Target
Renin
Ligand
BDBM50009879
Substrate
Meas. Tech.
ChEMBL_192728 (CHEMBL801755)
IC50
4.6±n/a nM
Citation
 Doherty, AMKaltenbronn, JSHudspeth, JPRepine, JTRoark, WHSircar, ITinney, FJConnolly, CJHodges, JCTaylor, MD New inhibitors of human renin that contain novel replacements at the P2 site. J Med Chem 34:1258-71 (1991)  
Target
Name:
Renin
Synonyms:
Angiotensinogenase RENI_HUMAN
Type:
Enzyme
Mol. Mass.:
45058.99
Organism:
Homo sapiens (Human)
Description:
Residue:
406
  
Inhibitor
Name:
BDBM50009879
Synonyms:
4-[6-Acetylamino-2-(3-naphthalen-1-yl-2-naphthalen-1-ylmethyl-propionylamino)-hex-4-ynoylamino]-3-hydroxy-6-methyl-heptanoic acid (2-methyl-butyl)-amide | CHEMBL23793
Type:
Small organic molecule
Emp. Form.:
C45H56N4O5
Mol. Mass.:
732.9499
SMILES:
CCC(C)CNC(=O)C[C@H](O)C(CC(C)C)NC(=O)C(CC#CCNC(C)=O)NC(=O)C(Cc1cccc2ccccc12)Cc1cccc2ccccc12
: