Target
Renin
Ligand
BDBM50009877
Substrate
Meas. Tech.
ChEMBL_195954 (CHEMBL806849)
IC50
14±n/a nM
Citation
 Doherty, AMKaltenbronn, JSHudspeth, JPRepine, JTRoark, WHSircar, ITinney, FJConnolly, CJHodges, JCTaylor, MD New inhibitors of human renin that contain novel replacements at the P2 site. J Med Chem 34:1258-71 (1991)  
Target
Name:
Renin
Synonyms:
Angiotensinogenase RENI_HUMAN
Type:
Enzyme
Mol. Mass.:
45058.99
Organism:
Homo sapiens (Human)
Description:
Residue:
406
  
Inhibitor
Name:
BDBM50009877
Synonyms:
1N-[4-[2-(2-aminoethyl)-1,4-oxazinan-4-yl]-1-cyclohexylmethyl-2-hydroxy-4-oxo-(1R,2S)-butyl]-2-(1-(N,N-Dimethyl-sulfonamide)amino-2-phenylethylcarboxamido)-6-methylamino(thioxo)methylaminohexanamide | CHEMBL280967
Type:
Small organic molecule
Emp. Form.:
C36H62N8O7S2
Mol. Mass.:
783.057
SMILES:
CNC(=S)NCCCCC(NC(=O)C(Cc1ccccc1)NS(=O)(=O)N(C)C)C(=O)NC(CC1CCCCC1)[C@@H](O)CC(=O)N1CCOC(CCN)C1
: