Target
Renin
Ligand
BDBM50009896
Substrate
Meas. Tech.
ChEMBL_195954 (CHEMBL806849)
IC50
3000±n/a nM
Citation
 Doherty, AMKaltenbronn, JSHudspeth, JPRepine, JTRoark, WHSircar, ITinney, FJConnolly, CJHodges, JCTaylor, MD New inhibitors of human renin that contain novel replacements at the P2 site. J Med Chem 34:1258-71 (1991)  
Target
Name:
Renin
Synonyms:
Angiotensinogenase RENI_HUMAN
Type:
Enzyme
Mol. Mass.:
45058.99
Organism:
Homo sapiens (Human)
Description:
Residue:
406
  
Inhibitor
Name:
BDBM50009896
Synonyms:
3-Hydroxy-6-methyl-4-[2-(3-naphthalen-1-yl-2-naphthalen-1-ylmethyl-propionylamino)-6-(toluene-4-sulfonylamino)-hexanoylamino]-heptanoic acid (2-methyl-butyl)-amide | CHEMBL22420
Type:
Small organic molecule
Emp. Form.:
C50H64N4O6S
Mol. Mass.:
849.131
SMILES:
CCC(C)CNC(=O)C[C@H](O)C(CC(C)C)NC(=O)C(CCCCNS(=O)(=O)c1ccc(C)cc1)NC(=O)C(Cc1cccc2ccccc12)Cc1cccc2ccccc12
: