Target
Renin
Ligand
BDBM50009900
Substrate
Meas. Tech.
ChEBML_192728
IC50
3.3±n/a nM
Citation
 Doherty, AMKaltenbronn, JSHudspeth, JPRepine, JTRoark, WHSircar, ITinney, FJConnolly, CJHodges, JCTaylor, MD New inhibitors of human renin that contain novel replacements at the P2 site. J Med Chem 34:1258-71 (1991)  
Target
Name:
Renin
Synonyms:
Angiotensinogenase RENI_HUMAN
Type:
Enzyme
Mol. Mass.:
45058.99
Organism:
Homo sapiens (Human)
Description:
Residue:
406
  
Inhibitor
Name:
BDBM50009900
Synonyms:
CHEMBL23944 | {5-{4-[2-(2-Amino-ethyl)-morpholin-4-yl]-3,3-difluoro-1-isobutyl-2,4-dioxo-butylcarbamoyl}-5-[2-(morpholine-4-sulfonylamino)-3-phenyl-propionylamino]-pentyl}-carbamic acid benzyl ester
Type:
Small organic molecule
Emp. Form.:
C41H59F2N7O10S
Mol. Mass.:
880.01
SMILES:
CC(C)CC(NC(=O)C(CCCCNC(=O)OCc1ccccc1)NC(=O)C(Cc1ccccc1)NS(=O)(=O)N1CCOCC1)C(=O)C(F)(F)C(=O)N1CCOC(CCN)C1
: