Target
Renin
Ligand
BDBM50009911
Substrate
Meas. Tech.
ChEBML_192728
IC50
2.3±n/a nM
Citation
 Doherty, AMKaltenbronn, JSHudspeth, JPRepine, JTRoark, WHSircar, ITinney, FJConnolly, CJHodges, JCTaylor, MD New inhibitors of human renin that contain novel replacements at the P2 site. J Med Chem 34:1258-71 (1991)  
Target
Name:
Renin
Synonyms:
Angiotensinogenase RENI_HUMAN
Type:
Enzyme
Mol. Mass.:
45058.99
Organism:
Homo sapiens (Human)
Description:
Residue:
406
  
Inhibitor
Name:
BDBM50009911
Synonyms:
6-(3-Methyl-thioureido)-2-[2-(morpholine-4-sulfonylamino)-3-phenyl-propionylamino]-hexanoic acid {4-[2-(2-amino-ethyl)-morpholin-4-yl]-1-cyclohexylmethyl-3,3-difluoro-2-hydroxy-4-oxo-butyl}-amide | CHEMBL22330
Type:
Small organic molecule
Emp. Form.:
C38H62F2N8O8S2
Mol. Mass.:
861.074
SMILES:
CNC(=S)NCCCCC(NC(=O)C(Cc1ccccc1)NS(=O)(=O)N1CCOCC1)C(=O)NC(CC1CCCCC1)[C@H](O)C(F)(F)C(=O)N1CCOC(CCN)C1
: