Target
Cathepsin D
Ligand
BDBM50009905
Substrate
Meas. Tech.
ChEMBL_45146 (CHEMBL657340)
IC50
781±n/a nM
Citation
 Doherty, AMKaltenbronn, JSHudspeth, JPRepine, JTRoark, WHSircar, ITinney, FJConnolly, CJHodges, JCTaylor, MD New inhibitors of human renin that contain novel replacements at the P2 site. J Med Chem 34:1258-71 (1991)  
Target
Name:
Cathepsin D
Synonyms:
CATD_BOVIN | CTSD
Type:
PROTEIN
Mol. Mass.:
42158.92
Organism:
Bos taurus
Description:
ChEMBL_1458606
Residue:
387
  
Inhibitor
Name:
BDBM50009905
Synonyms:
3-Hydroxy-6-methyl-4-[6-(3-methyl-thioureido)-2-(3-naphthalen-1-yl-2-naphthalen-1-ylmethyl-propionylamino)-hexanoylamino]-heptanoic acid (2-methyl-butyl)-amide | CHEMBL23232
Type:
Small organic molecule
Emp. Form.:
C45H61N5O4S
Mol. Mass.:
768.062
SMILES:
CCC(C)CNC(=O)C[C@H](O)C(CC(C)C)NC(=O)C(CCCCNC(=S)NC)NC(=O)C(Cc1cccc2ccccc12)Cc1cccc2ccccc12
: