Target
Polyunsaturated fatty acid 5-lipoxygenase
Ligand
BDBM50009937
Substrate
Meas. Tech.
ChEBML_734
IC50
140±n/a nM
Citation
 Hlasta, DJCasey, FBFerguson, EWGangell, SJHeimann, MRJaeger, EPKullnig, RKGordon, RJ 5-Lipoxygenase inhibitors: the synthesis and structure-activity relationships of a series of 1-phenyl-3-pyrazolidinones. J Med Chem 34:1560-70 (1991)  
Target
Name:
Polyunsaturated fatty acid 5-lipoxygenase
Synonyms:
Alox5 LOX5_RAT
Type:
PROTEIN
Mol. Mass.:
78082.31
Organism:
Rattus norvegicus
Description:
ChEMBL_1432947
Residue:
673
  
Inhibitor
Name:
BDBM50009937
Synonyms:
1-Phenyl-4-thiophen-2-ylmethyl-pyrazolidin-3-one | CHEMBL41576
Type:
Small organic molecule
Emp. Form.:
C14H14N2OS
Mol. Mass.:
258.339
SMILES:
O=C1NN(CC1Cc1cccs1)c1ccccc1
: