Target
Polyunsaturated fatty acid 5-lipoxygenase
Ligand
BDBM50009944
Substrate
Meas. Tech.
ChEBML_734
IC50
500±n/a nM
Citation
 Hlasta, DJCasey, FBFerguson, EWGangell, SJHeimann, MRJaeger, EPKullnig, RKGordon, RJ 5-Lipoxygenase inhibitors: the synthesis and structure-activity relationships of a series of 1-phenyl-3-pyrazolidinones. J Med Chem 34:1560-70 (1991)  
Target
Name:
Polyunsaturated fatty acid 5-lipoxygenase
Synonyms:
Alox5 LOX5_RAT
Type:
PROTEIN
Mol. Mass.:
78082.31
Organism:
Rattus norvegicus
Description:
ChEMBL_1432947
Residue:
673
  
Inhibitor
Name:
BDBM50009944
Synonyms:
1-(4-Benzyloxy-phenyl)-4-(2-methoxy-ethyl)-pyrazolidin-3-one | CHEMBL43182
Type:
Small organic molecule
Emp. Form.:
C19H22N2O3
Mol. Mass.:
326.3896
SMILES:
COCCC1CN(NC1=O)c1ccc(OCc2ccccc2)cc1
: