Target
Polyunsaturated fatty acid 5-lipoxygenase
Ligand
BDBM50009931
Substrate
Meas. Tech.
ChEMBL_734 (CHEMBL615636)
IC50
480±n/a nM
Citation
 Hlasta, DJCasey, FBFerguson, EWGangell, SJHeimann, MRJaeger, EPKullnig, RKGordon, RJ 5-Lipoxygenase inhibitors: the synthesis and structure-activity relationships of a series of 1-phenyl-3-pyrazolidinones. J Med Chem 34:1560-70 (1991)  
Target
Name:
Polyunsaturated fatty acid 5-lipoxygenase
Synonyms:
Alox5 LOX5_RAT
Type:
PROTEIN
Mol. Mass.:
78082.31
Organism:
Rattus norvegicus
Description:
ChEMBL_1432947
Residue:
673
  
Inhibitor
Name:
BDBM50009931
Synonyms:
4-(2-Methoxy-ethyl)-1-phenyl-pyrazolidin-3-one | CHEMBL291227
Type:
Small organic molecule
Emp. Form.:
C12H16N2O2
Mol. Mass.:
220.2676
SMILES:
COCCC1CN(NC1=O)c1ccccc1
: