Target
Thromboxane A2 receptor
Ligand
BDBM50010078
Substrate
Meas. Tech.
ChEBML_209599
Kd
6±n/a nM
Citation
 Misra, RNBrown, BRHan, WCHarris, DNHedberg, AWebb, MLHall, SE Interphenylene 7-oxabicyclo[2.2.1]heptane thromboxane A2 antagonists. Semicarbazone omega-chains. J Med Chem 34:2882-91 (1991)  
Target
Name:
Thromboxane A2 receptor
Synonyms:
Prostanoid TP receptor TBXA2R Thromboxane Thromboxane Beta
Type:
Enyzme
Mol. Mass.:
37445.28
Organism:
Homo sapiens (Human)
Description:
P21731
Residue:
343
  
Inhibitor
Name:
BDBM50010078
Synonyms:
CHEMBL95884 | [2-(5-oxabicyclo[2.2.1],3-formaldehyde (anilinocarbonyl)hydrazone-hept-2-ylmethyl)phenoxy]acetic acid
Type:
Small organic molecule
Emp. Form.:
C23H25N3O5
Mol. Mass.:
423.4617
SMILES:
OC(=O)COc1ccccc1CC1C2CCC(O2)C1C=NNC(=O)Nc1ccccc1
: