Target
Sigma intracellular receptor 2
Ligand
BDBM50048866
Substrate
Meas. Tech.
ChEMBL_1694032 (CHEMBL4044922)
Ki
0.340000±n/a nM
Citation
 Fanter, LMüller, CSchepmann, DBracher, FWünsch, B Chiral-pool synthesis of 1,2,4-trisubstituted 1,4-diazepanes as novel? Bioorg Med Chem 25:4778-4799 (2017)  
Target
Name:
Sigma intracellular receptor 2
Synonyms:
S2r Sigma intracellular receptor 2 Sigma2 receptor Transmembrane protein 97
Type:
Protein
Mol. Mass.:
20953.88
Organism:
Rattus norvegicus (Rat)
Description:
Q5U3Y7
Residue:
176
  
Inhibitor
Name:
BDBM50048866
Synonyms:
1-Cyclohexyl-4-[3-(5-methoxy-1,2,3,4-tetrahydro-naphthalen-1-yl)-propyl]-piperazine 1-cyclohexyl-4-[3-(5-methoxy-1,2,3,4-tetrahydro-naphthalen-1-yl)propyl]piperazine CHEMBL53325 | PB-28
Type:
Small organic molecule
Emp. Form.:
C24H38N2O
Mol. Mass.:
370.5713
SMILES:
COc1cccc2C(CCCN3CCN(CC3)C3CCCCC3)CCCc12
: