Target
Integrin alpha-IIb/beta-3
Ligand
BDBM50003326
Substrate
Meas. Tech.
ChEMBL_90488 (CHEMBL702489)
Ki
62000±n/a nM
Citation
 Samanen, JAli, FRomoff, TCalvo, RSorenson, EVasko, JStorer, BBerry, DBennett, DStrohsacker, M Development of a small RGD peptide fibrinogen receptor antagonist with potent antiaggregatory activity in vitro. J Med Chem 34:3114-25 (1991)  
Target
Name:
Integrin alpha-IIb/beta-3
Synonyms:
Glycoprotein IIb/IIIa
Type:
Mol. Mass.:
Description:
ASSAY_ID of EBI is 30109
Components:
This complex has 2 components.
Component 1
Name:
Integrin beta-3
Synonyms:
CD_antigen=CD61 GPIIIa ITGB3 Platelet membrane glycoprotein IIIa
Type:
Protein
Mol. Mass.:
87038.91
Organism:
Homo sapiens (Human)
Description:
P05106
Residue:
788
  
Component 2
Name:
Integrin alpha-IIb
Synonyms:
CD_antigen=CD41 GPIIb Glycoprotein IIb ITGA2B Integrin alpha-IIb heavy chain Integrin alpha-IIb light chain, form 2 Integrin alpha-V/beta-3 and alpha-IIb/beta 3 | Platelet membrane glycoprotein IIb
Type:
Protein
Mol. Mass.:
113354.85
Organism:
Homo sapiens (Human)
Description:
P08514
Residue:
1039
  
Inhibitor
Name:
BDBM50003326
Synonyms:
3-[2-(2-Acetylamino-5-guanidino-pentanoylamino)-acetylamino]-N-(1-carbamoyl-2-hydroxy-ethyl)-succinamic acid CHEMBL420106
Type:
Small organic molecule
Emp. Form.:
C17H30N8O8
Mol. Mass.:
474.4689
SMILES:
CC(=O)N[C@@H](CCCNC(N)=N)C(=O)NCC(=O)N[C@@H](CC(O)=O)C(=O)N[C@@H](CO)C(N)=O
: