Target
Sodium channel protein type 9 subunit alpha
Ligand
BDBM50261077
Substrate
Meas. Tech.
ChEMBL_1695596 (CHEMBL4046486)
IC50
34±n/a nM
Citation
 Wu, YJGuernon, JMcClure, ALuo, GRajamani, RNg, AEaston, ANewton, ABourin, CParker, DMosure, KBarnaby, OSoars, MGKnox, RJMatchett, MPieschl, RHerrington, JChen, PSivarao, DVBristow, LJMeanwell, NABronson, JOlson, RThompson, LADzierba, C Discovery of non-zwitterionic aryl sulfonamides as Na Bioorg Med Chem 25:5490-5505 (2017)  
Target
Name:
Sodium channel protein type 9 subunit alpha
Synonyms:
Kiaa4197 Peripheral sodium channel 1 Scn9a Sodium channel protein type IX subunit alpha | Voltage-gated sodium channel subunit alpha Nav1.7
Type:
PROTEIN
Mol. Mass.:
225808.99
Organism:
Mus musculus
Description:
ChEMBL_109594
Residue:
1984
  
Inhibitor
Name:
BDBM50261077
Synonyms:
CHEMBL4072883
Type:
Small organic molecule
Emp. Form.:
C15H17ClFN3O3S2
Mol. Mass.:
405.895
SMILES:
Fc1cc(NC[C@H]2CCCOC2)c(Cl)cc1S(=O)(=O)Nc1nccs1
: