Target
Cyclin-dependent kinase 5 activator 1
Ligand
BDBM50261164
Substrate
Meas. Tech.
ChEMBL_1695674 (CHEMBL4046564)
IC50
2.3±n/a nM
Citation
 Park, SJKim, EYoo, MLee, JYPark, CHHwang, JYHa, JD Synthesis and biological evaluation of N9-cis-cyclobutylpurine derivatives for use as cyclin-dependent kinase (CDK) inhibitors. Bioorg Med Chem Lett 27:4399-4404 (2017)  
Target
Name:
Cyclin-dependent kinase 5 activator 1
Synonyms:
CDK5/p35 Cyclin-dependent kinase 5 regulatory subunit 1 | Cyclin-dependent kinase 5/CDK5 activator 1
Type:
Protein Complex
Mol. Mass.:
Description:
Components:
This complex has 2 components.
Component 1
Name:
Cyclin-dependent kinase 5
Synonyms:
CDK5 CDKN5 Cyclin-dependent kinase 5 (CDK5/ p25) Cyclin-dependent-like kinase 5 PSSALRE Tau protein kinase II catalytic subunit
Type:
Enzyme Subunit
Mol. Mass.:
33308.61
Organism:
Homo sapiens (Human)
Description:
Residue:
292
  
Component 2
Name:
Cyclin-dependent kinase 5 activator 1
Synonyms:
CD5R1_HUMAN CDK5R1 Cyclin-dependent kinase 5 (CDK5/p25) NCK5A p35
Type:
Enzyme Subunit
Mol. Mass.:
34077.43
Organism:
Homo sapiens (Human)
Description:
Q15078
Residue:
307
  
Inhibitor
Name:
BDBM50261164
Synonyms:
CHEMBL4103221
Type:
Small organic molecule
Emp. Form.:
C23H22ClN7O
Mol. Mass.:
447.92
SMILES:
Cc1cccc(n1)C(=O)N[C@H]1C[C@H](C1)n1cnc2c(NCc3cccc(Cl)c3)ncnc12
: