Target
Tyrosine-protein kinase JAK2
Ligand
BDBM50261270
Substrate
Meas. Tech.
ChEMBL_1695704 (CHEMBL4046594)
EC50
460±n/a nM
Citation
 Liang, JVan Abbema, ABalazs, MBarrett, KBerezhkovsky, LBlair, WSChang, CDelarosa, DDeVoss, JDriscoll, JEigenbrot, CGoodacre, SGhilardi, NMacLeod, CJohnson, ABir Kohli, PLai, YLin, ZMantik, PMenghrajani, KNguyen, HPeng, ISambrone, AShia, SSmith, JSohn, STsui, VUltsch, MWilliams, KWu, LCYang, WZhang, BMagnuson, S Identification of an imidazopyridine scaffold to generate potent and selective TYK2 inhibitors that demonstrate activity in an in vivo psoriasis model. Bioorg Med Chem Lett 27:4370-4376 (2017)  
Target
Name:
Tyrosine-protein kinase JAK2
Synonyms:
JAK-2 JAK2_HUMAN Janus kinase 2 (JAK2) | Janus kinase 2 (a protein tyrosine kinase)
Type:
Protein
Mol. Mass.:
130684.68
Organism:
Homo sapiens (Human)
Description:
O60674
Residue:
1132
  
Inhibitor
Name:
BDBM50261270
Synonyms:
CHEMBL4093872
Type:
Small organic molecule
Emp. Form.:
C20H17Cl2N7O
Mol. Mass.:
442.301
SMILES:
Clc1cccc(Cl)c1-c1nc2ccnc(Nc3cc(ncn3)N3CCOCC3)c2[nH]1
: