Target
Non-receptor tyrosine-protein kinase TYK2
Ligand
BDBM50261283
Substrate
Meas. Tech.
ChEBML_1695702
Ki
0.800000±n/a nM
Citation
 Liang, JVan Abbema, ABalazs, MBarrett, KBerezhkovsky, LBlair, WSChang, CDelarosa, DDeVoss, JDriscoll, JEigenbrot, CGoodacre, SGhilardi, NMacLeod, CJohnson, ABir Kohli, PLai, YLin, ZMantik, PMenghrajani, KNguyen, HPeng, ISambrone, AShia, SSmith, JSohn, STsui, VUltsch, MWilliams, KWu, LCYang, WZhang, BMagnuson, S Identification of an imidazopyridine scaffold to generate potent and selective TYK2 inhibitors that demonstrate activity in an in vivo psoriasis model. Bioorg Med Chem Lett 27:4370-4376 (2017)  
Target
Name:
Non-receptor tyrosine-protein kinase TYK2
Synonyms:
Non-receptor tyrosine-protein kinase TYK2 (TYK2) TYK2_HUMAN | Tyrosine-protein kinase TYK2
Type:
Protein
Mol. Mass.:
133666.03
Organism:
Homo sapiens (Human)
Description:
P29597
Residue:
1187
  
Inhibitor
Name:
BDBM50261283
Synonyms:
CHEMBL4093172
Type:
Small organic molecule
Emp. Form.:
C17H12Cl2N2OS
Mol. Mass.:
363.261
SMILES:
Clc1cccc(Cl)c1-c1cc2ccnc(NC(=O)C3CC3)c2s1
: