Target
Adenylate cyclase type 1
Ligand
BDBM50010270
Substrate
Meas. Tech.
ChEMBL_31296 (CHEMBL643977)
Kd
10±n/a nM
Citation
 Robbins, JDLaurenza, AKosley, RWO'Malley, GJSpahl, BSeamon, KB (Aminoalkyl)carbamates of forskolin: intermediates for the synthesis of functionalized derivatives of forskolin with different specificities for adenylyl cyclase and the glucose transporter. J Med Chem 34:3204-12 (1991)  
Target
Name:
Adenylate cyclase type 1
Synonyms:
ADCY1 Adenylate cyclase type I
Type:
PROTEIN
Mol. Mass.:
124005.57
Organism:
Bos taurus
Description:
ChEMBL_31291
Residue:
1134
  
Inhibitor
Name:
BDBM50010270
Synonyms:
Acetic acid 6-[2-(2-bromo-acetylamino)-ethylcarbamoyloxy]-10,10b-dihydroxy-3,4a,7,7,10a-pentamethyl-1-oxo-3-vinyl-dodecahydro-benzo[f]chromen-5-yl ester | CHEMBL111514
Type:
Small organic molecule
Emp. Form.:
C27H41BrN2O9
Mol. Mass.:
617.526
SMILES:
CC(=O)O[C@H]1[C@@H](OC(=O)NCCNC(=O)CBr)[C@H]2C(C)(C)CC[C@H](O)[C@]2(C)[C@@]2(O)C(=O)C[C@@](C)(O[C@]12C)C=C
: