Target
Aldo-keto reductase family 1 member B1
Ligand
BDBM50010442
Substrate
Meas. Tech.
ChEBML_218061
Ki
56000±n/a nM
Citation
 Deck, LMVander Jagt, DLRoyer, RE Gossypol and derivatives: a new class of aldose reductase inhibitors. J Med Chem 34:3301-5 (1991)  
Target
Name:
Aldo-keto reductase family 1 member B1
Synonyms:
AKR1B1 ALDR_HUMAN AR Aldose Reductase (ALR2) Aldose reductase (AR)
Type:
Protein
Mol. Mass.:
35855.50
Organism:
Homo sapiens (Human)
Description:
P15121. 4LAU; 2IKI; 4LB4; 2FZD; 2FZ8; 1US0
Residue:
316
  
Inhibitor
Name:
BDBM50010442
Synonyms:
5,5'-Diisopropyl-1,6,7,1',6',7'-hexamethoxy-3,3'-dimethyl-[2,2']binaphthalenyl-8,8'-dicarbaldehyde | CHEMBL109986
Type:
Small organic molecule
Emp. Form.:
C36H42O8
Mol. Mass.:
602.7139
SMILES:
COc1c(OC)c(C(C)C)c2cc(C)c(c(OC)c2c1C=O)-c1c(C)cc2c(C(C)C)c(OC)c(OC)c(C=O)c2c1OC
: