Target
Aldo-keto reductase family 1 member B1
Ligand
BDBM50010446
Substrate
Meas. Tech.
ChEBML_218061
Ki
1500±n/a nM
Citation
 Deck, LMVander Jagt, DLRoyer, RE Gossypol and derivatives: a new class of aldose reductase inhibitors. J Med Chem 34:3301-5 (1991)  
Target
Name:
Aldo-keto reductase family 1 member B1
Synonyms:
AKR1B1 ALDR_HUMAN AR Aldose Reductase (ALR2) Aldose reductase (AR)
Type:
Protein
Mol. Mass.:
35855.50
Organism:
Homo sapiens (Human)
Description:
P15121. 4LAU; 2IKI; 4LB4; 2FZD; 2FZ8; 1US0
Residue:
316
  
Inhibitor
Name:
BDBM50010446
Synonyms:
1,7,1',7'-Tetrahydroxy-5,5'-diisopropyl-6,6'-dimethoxy-3,3'-dimethyl-[2,2']binaphthalenyl-8,8'-dicarbaldehyde | CHEMBL112743
Type:
Small organic molecule
Emp. Form.:
C32H34O8
Mol. Mass.:
546.6076
SMILES:
COc1c(O)c(C=O)c2c(O)c(c(C)cc2c1C(C)C)-c1c(C)cc2c(C(C)C)c(OC)c(O)c(C=O)c2c1O
: