Target
Aldo-keto reductase family 1 member B1
Ligand
BDBM50010448
Substrate
Meas. Tech.
ChEBML_218061
Ki
9300.0±n/a nM
Citation
 Deck, LMVander Jagt, DLRoyer, RE Gossypol and derivatives: a new class of aldose reductase inhibitors. J Med Chem 34:3301-5 (1991)  
Target
Name:
Aldo-keto reductase family 1 member B1
Synonyms:
AKR1B1 ALDR_HUMAN AR Aldose Reductase (ALR2) Aldose reductase (AR)
Type:
Protein
Mol. Mass.:
35855.50
Organism:
Homo sapiens (Human)
Description:
P15121. 4LAU; 2IKI; 4LB4; 2FZD; 2FZ8; 1US0
Residue:
316
  
Inhibitor
Name:
BDBM50010448
Synonyms:
2,2'-Diimino-5,5'-diisopropyl-7,7'-dimethyl-2H,2'H-[8,8']bi[naphtho[1,8-bc]furanyl]-3,4,3',4'-tetraol | CHEMBL424250
Type:
Small organic molecule
Emp. Form.:
C30H28N2O6
Mol. Mass.:
512.5531
SMILES:
CC(C)c1c(O)c(O)c2C(=N)Oc3c(c(C)cc1c23)-c1c2OC(=N)c3c(O)c(O)c(C(C)C)c(cc1C)c23
: