Target
Mu-type opioid receptor
Ligand
BDBM50010545
Substrate
Meas. Tech.
ChEBML_146989
IC50
0.500000±n/a nM
Citation
 Yoshino, HNakazawa, TArakawa, YKaneko, TTsuchiya, YMatsunaga, MAraki, SIkeda, MYamatsu, KTachibana, S Synthesis and structure-activity relationships of dynorphin A-(1-8) amide analogues. J Med Chem 33:206-12 (1990)  
Target
Name:
Mu-type opioid receptor
Synonyms:
M-OR-1 Mu opioid receptor OPIATE Mu OPRM_CAVPO
Type:
Enzyme Catalytic Domain
Mol. Mass.:
11165.58
Organism:
GUINEA PIG
Description:
P97266
Residue:
98
  
Inhibitor
Name:
BDBM50010545
Synonyms:
2-{5-Guanidino-2-[(5-guanidino-2-{2-[2-(2-{2-[3-(4-hydroxy-phenyl)-2-methylamino-propionylamino]-acetylamino}-acetylamino)-3-(4-nitro-phenyl)-propionylamino]-4-methyl-pentanoylamino}-pentanoyl)-methyl-amino]-pentanoylamino}-4-methyl-pentanoic acidN-ethyl amide | CHEMBL415410
Type:
Small organic molecule
Emp. Form.:
C50H80N16O11
Mol. Mass.:
1081.2708
SMILES:
CCNC(=O)C(CC(C)C)NC(=O)C(CCC[N-]C(N)=[NH2+])N(C)C(=O)C(CCC[N-]C(N)=[NH2+])NC(=O)C(CC(C)C)NC(=O)C(Cc1ccc(cc1)[N+]([O-])=O)NC(=O)CNC(=O)CNC(=O)C(Cc1ccc(O)cc1)NC
: