Target
Delta-type opioid receptor
Ligand
BDBM50010531
Substrate
Meas. Tech.
ChEBML_145634
IC50
9.1±n/a nM
Citation
 Yoshino, HNakazawa, TArakawa, YKaneko, TTsuchiya, YMatsunaga, MAraki, SIkeda, MYamatsu, KTachibana, S Synthesis and structure-activity relationships of dynorphin A-(1-8) amide analogues. J Med Chem 33:206-12 (1990)  
Target
Name:
Delta-type opioid receptor
Synonyms:
DOR-1 MSL-2 OPRD_MOUSE Oprd1
Type:
Enzyme Catalytic Domain
Mol. Mass.:
40577.25
Organism:
MOUSE
Description:
P32300
Residue:
372
  
Inhibitor
Name:
BDBM50010531
Synonyms:
2-[2-(2-{2-[2-(2-{2-[2-Amino-3-(4-hydroxy-phenyl)-propionylamino]-propionylamino}-acetylamino)-3-phenyl-propionylamino]-4-methyl-pentanoylamino}-5-guanidino-pentanoylamino)-5-guanidino-pentanoylamino]-4-methyl-pentanoic acid amide | CHEMBL412324
Type:
Small organic molecule
Emp. Form.:
C47H75N15O9
Mol. Mass.:
994.1935
SMILES:
CC(C)C[C@H](NC(=O)[C@H](CCCNC(N)=N)NC(=O)[C@H](CCCNC(N)=N)NC(=O)[C@H](CC(C)C)NC(=O)[C@H](Cc1ccccc1)NC(=O)CNC(=O)[C@H](C)NC(=O)[C@@H](N)Cc1ccc(O)cc1)C(N)=O
: