Target
Kappa-type opioid receptor
Ligand
BDBM50010542
Substrate
Meas. Tech.
ChEBML_145678
IC50
5.5±n/a nM
Citation
 Yoshino, HNakazawa, TArakawa, YKaneko, TTsuchiya, YMatsunaga, MAraki, SIkeda, MYamatsu, KTachibana, S Synthesis and structure-activity relationships of dynorphin A-(1-8) amide analogues. J Med Chem 33:206-12 (1990)  
Target
Name:
Kappa-type opioid receptor
Synonyms:
K-OR-1 Kappa-opioid receptor (KOR) Kappa-type opioid receptor (KOR) OPIATE Kappa OPRK1 kappa opioid receptor (KOR)
Type:
G Protein-Coupled Receptor (GPCR)
Mol. Mass.:
42648.76
Organism:
Homo sapiens (Human)
Description:
P41145
Residue:
380
  
Inhibitor
Name:
BDBM50010542
Synonyms:
2-[5-Guanidino-2-(5-guanidino-2-{2-[2-(2-{2-[3-(4-hydroxy-phenyl)-2-methylamino-propionylamino]-acetylamino}-acetylamino)-3-(4-nitro-phenyl)-propionylamino]-4-methyl-pentanoylamino}-pentanoylamino)-pentanoylamino]-4-methyl-pentanoic acid amide | CHEMBL410611
Type:
Small organic molecule
Emp. Form.:
C47H74N16O11
Mol. Mass.:
1039.1911
SMILES:
CNC(Cc1ccc(O)cc1)C(=O)NCC(=O)NCC(=O)NC(Cc1ccc(cc1)[N+]([O-])=O)C(=O)NC(CC(C)C)C(=O)NC(CCC[N-]C(N)=[NH2+])C(=O)NC(CCC[N-]C(N)=[NH2+])C(=O)NC(CC(C)C)C(N)=O
: