Target
Mu-type opioid receptor
Ligand
BDBM50010547
Substrate
Meas. Tech.
ChEBML_146989
IC50
12±n/a nM
Citation
 Yoshino, HNakazawa, TArakawa, YKaneko, TTsuchiya, YMatsunaga, MAraki, SIkeda, MYamatsu, KTachibana, S Synthesis and structure-activity relationships of dynorphin A-(1-8) amide analogues. J Med Chem 33:206-12 (1990)  
Target
Name:
Mu-type opioid receptor
Synonyms:
M-OR-1 Mu opioid receptor OPIATE Mu OPRM_CAVPO
Type:
Enzyme Catalytic Domain
Mol. Mass.:
11165.58
Organism:
GUINEA PIG
Description:
P97266
Residue:
98
  
Inhibitor
Name:
BDBM50010547
Synonyms:
2-{5-Guanidino-2-[5-guanidino-2-(2-{[2-(2-{2-[3-(4-hydroxy-phenyl)-2-methylamino-propionylamino]-acetylamino}-acetylamino)-3-phenyl-propionyl]-methyl-amino}-4-methyl-pentanoylamino)-pentanoylamino]-pentanoylamino}-4-methyl-pentanoic acid amide | CHEMBL216351
Type:
Small organic molecule
Emp. Form.:
C48H77N15O9
Mol. Mass.:
1008.2201
SMILES:
CN[C@@H](Cc1ccc(O)cc1)C(=O)NCC(=O)NCC(=O)N[C@H](Cc1ccccc1)C(=O)N(C)[C@@H](CC(C)C)C(=O)N[C@@H](CCCNC(N)=N)C(=O)N[C@@H](CCCNC(N)=N)C(=O)N[C@@H](CC(C)C)C(N)=O
: