Target
Kappa-type opioid receptor
Ligand
BDBM50010534
Substrate
Meas. Tech.
ChEBML_145678
IC50
2.6±n/a nM
Citation
 Yoshino, HNakazawa, TArakawa, YKaneko, TTsuchiya, YMatsunaga, MAraki, SIkeda, MYamatsu, KTachibana, S Synthesis and structure-activity relationships of dynorphin A-(1-8) amide analogues. J Med Chem 33:206-12 (1990)  
Target
Name:
Kappa-type opioid receptor
Synonyms:
K-OR-1 Kappa-opioid receptor (KOR) Kappa-type opioid receptor (KOR) OPIATE Kappa OPRK1 kappa opioid receptor (KOR)
Type:
G Protein-Coupled Receptor (GPCR)
Mol. Mass.:
42648.76
Organism:
Homo sapiens (Human)
Description:
P41145
Residue:
380
  
Inhibitor
Name:
BDBM50010534
Synonyms:
2-[2-(2-{2-[3-(4-Hydroxy-phenyl)-2-methylamino-propionylamino]-acetylamino}-acetylamino)-3-phenyl-propionylamino]-4-methyl-pentanoic acid (1-{[1-(1-ethylcarbamoyl-3-methyl-butylcarbamoyl)-4-guanidino-butyl]-methyl-carbamoyl}-4-guanidino-butyl)-amide | CHEMBL412325
Type:
Small organic molecule
Emp. Form.:
C50H81N15O9
Mol. Mass.:
1036.2732
SMILES:
CCNC(=O)[C@H](CC(C)C)NC(=O)[C@H](CCCNC(N)=N)N(C)C(=O)[C@H](CCCNC(N)=N)NC(=O)[C@H](CC(C)C)NC(=O)[C@@H](Cc1ccccc1)NC(=O)CNC(=O)CNC(=O)[C@H](Cc1ccc(O)cc1)NC
: