Target
Beta-2 adrenergic receptor
Ligand
BDBM50010565
Substrate
Meas. Tech.
ChEBML_196404
Ki
1180±n/a nM
Citation
 Leftheris, KGoodman, M Synthesis and beta-adrenergic antagonist activity of stereoisomeric practolol and propranolol derivatives. J Med Chem 33:216-23 (1990)  
Target
Name:
Beta-2 adrenergic receptor
Synonyms:
ADRB2_MOUSE Adrb2r Beta-2 adrenoceptor Beta-adrenergic receptor
Type:
PROTEIN
Mol. Mass.:
47002.38
Organism:
Mus musculus
Description:
ChEMBL_196404
Residue:
418
  
Inhibitor
Name:
BDBM50010565
Synonyms:
6-[3-(4-Acetylamino-phenoxy)-2-hydroxy-propylamino]-heptanoic acid p-tolylamide | CHEMBL70809
Type:
Small organic molecule
Emp. Form.:
C25H35N3O4
Mol. Mass.:
441.5631
SMILES:
CC(CCCCC(=O)Nc1ccc(C)cc1)NCC(O)COc1ccc(NC(C)=O)cc1
: