Target
Histamine H3 receptor
Ligand
BDBM50406095
Substrate
Meas. Tech.
ChEMBL_83827 (CHEMBL691844)
Ki
631±n/a nM
Citation
 Timmerman, H Histamine H3 ligands: just pharmacological tools or potential therapeutic agents? J Med Chem 33:4-11 (1990)  
Target
Name:
Histamine H3 receptor
Synonyms:
HH3R Hrh3
Type:
G Protein-Coupled Receptor (GPCR)
Mol. Mass.:
48607.98
Organism:
Rattus norvegicus (rat)
Description:
Residue:
445
  
Inhibitor
Name:
BDBM50406095
Synonyms:
CHEMBL275090
Type:
Small organic molecule
Emp. Form.:
C15H21N3
Mol. Mass.:
243.3473
SMILES:
C(CCc1ccccc1)CNCCc1cnc[nH]1
: