Target
Histamine H3 receptor
Ligand
BDBM50406097
Substrate
Meas. Tech.
ChEMBL_83827 (CHEMBL691844)
Ki
1000±n/a nM
Citation
 Timmerman, H Histamine H3 ligands: just pharmacological tools or potential therapeutic agents? J Med Chem 33:4-11 (1990)  
Target
Name:
Histamine H3 receptor
Synonyms:
HH3R Hrh3
Type:
G Protein-Coupled Receptor (GPCR)
Mol. Mass.:
48607.98
Organism:
Rattus norvegicus (rat)
Description:
Residue:
445
  
Inhibitor
Name:
BDBM50406097
Synonyms:
CHEMBL12551
Type:
Small organic molecule
Emp. Form.:
C21H23N3O
Mol. Mass.:
333.4268
SMILES:
O=C(CCC(c1ccccc1)c1ccccc1)NCCc1cnc[nH]1
: