Target
Histamine H3 receptor
Ligand
BDBM50406098
Substrate
Meas. Tech.
ChEBML_83827
Ki
79±n/a nM
Citation
 Timmerman, H Histamine H3 ligands: just pharmacological tools or potential therapeutic agents? J Med Chem 33:4-11 (1990)  
Target
Name:
Histamine H3 receptor
Synonyms:
HH3R Hrh3
Type:
G Protein-Coupled Receptor (GPCR)
Mol. Mass.:
48607.98
Organism:
Rattus norvegicus (rat)
Description:
Residue:
445
  
Inhibitor
Name:
BDBM50406098
Synonyms:
CHEMBL12494
Type:
Small organic molecule
Emp. Form.:
C15H19N3O
Mol. Mass.:
257.3309
SMILES:
O=C(CCCc1ccccc1)NCCc1cnc[nH]1
: