Target
Sodium-dependent serotonin transporter
Ligand
BDBM50010589
Substrate
Meas. Tech.
ChEMBL_202309 (CHEMBL810770)
Kd
0.127000±n/a nM
Citation
 Nichols, DEBrewster, WKJohnson, MPOberlender, RRiggs, RM Nonneurotoxic tetralin and indan analogues of 3,4-(methylenedioxy)amphetamine (MDA). J Med Chem 33:703-10 (1990)  
Target
Name:
Sodium-dependent serotonin transporter
Synonyms:
5-HT Transporter 5HT transporter Anandamid membrane transporter, AMT Monoamine transporters; Norepinephrine & serotonin Slc6a4 Sodium-dependent serotonin transporter (SERT) | imipramine receptor
Type:
Multi-pass membrane protein
Mol. Mass.:
70168.43
Organism:
Rattus norvegicus (rat)
Description:
P31652
Residue:
630
  
Inhibitor
Name:
BDBM50010589
Synonyms:
6,7-Dihydro-5H-indeno[5,6-d][1,3]dioxol-6-ylamine | CHEMBL162375
Type:
Small organic molecule
Emp. Form.:
C10H11NO2
Mol. Mass.:
177.1998
SMILES:
NC1Cc2cc3OCOc3cc2C1
: