Target
D(2) dopamine receptor
Ligand
BDBM50010591
Substrate
Meas. Tech.
ChEBML_58691
IC50
>10000±n/a nM
Citation
 Davis, DAde Paulis, TJanowsky, ASmith, HE Chloro-substituted, sterically hindered 5,11-dicarbo analogues of clozapine as potential chiral antipsychotic agents. J Med Chem 33:809-14 (1990)  
Target
Name:
D(2) dopamine receptor
Synonyms:
DOPAMINE D2 DOPAMINE D2 Short Dopamine D2 receptor Drd2
Type:
G Protein-Coupled Receptor (GPCR)
Mol. Mass.:
50931.60
Organism:
Rattus norvegicus (rat)
Description:
P61169
Residue:
444
  
Inhibitor
Name:
BDBM50010591
Synonyms:
11-(4-Methyl-piperazin-1-yl)-5H-dibenzo[b,e][1,4]diazepine | CHEMBL73538
Type:
Small organic molecule
Emp. Form.:
C18H20N4
Mol. Mass.:
292.3782
SMILES:
CN1CCN(CC1)C1=Nc2ccccc2Nc2ccccc12
: