Target
D(2) dopamine receptor
Ligand
BDBM50010618
Substrate
Meas. Tech.
ChEMBL_61575 (CHEMBL675089)
IC50
98±n/a nM
Citation
 Liljefors, TBøgesø, KPHyttel, JWikström, HSvensson, KCarlsson, A Pre- and postsynaptic dopaminergic activities of indolizidine and quinolizidine derivatives of 3-(3-hydroxyphenyl)-N-(n-propyl)piperidine (3-PPP). Further developments of a dopamine receptor model. J Med Chem 33:1015-22 (1990)  
Target
Name:
D(2) dopamine receptor
Synonyms:
DOPAMINE D2 DOPAMINE D2 Short Dopamine D2 receptor Drd2
Type:
G Protein-Coupled Receptor (GPCR)
Mol. Mass.:
50931.60
Organism:
Rattus norvegicus (rat)
Description:
P61169
Residue:
444
  
Inhibitor
Name:
BDBM50010618
Synonyms:
(+)-3-(1-Propyl-piperidin-3-yl)-phenol 3-(1-Propyl-piperidin-3-yl)-phenol CHEMBL7393 | cid_202478
Type:
Small organic molecule
Emp. Form.:
C14H21NO
Mol. Mass.:
219.3226
SMILES:
CCCN1CCC[C@@H](C1)c1cccc(O)c1
: