Target
D(2) dopamine receptor
Ligand
BDBM50010620
Substrate
Meas. Tech.
ChEBML_61576
IC50
170±n/a nM
Citation
 Liljefors, TBøgesø, KPHyttel, JWikström, HSvensson, KCarlsson, A Pre- and postsynaptic dopaminergic activities of indolizidine and quinolizidine derivatives of 3-(3-hydroxyphenyl)-N-(n-propyl)piperidine (3-PPP). Further developments of a dopamine receptor model. J Med Chem 33:1015-22 (1990)  
Target
Name:
D(2) dopamine receptor
Synonyms:
DOPAMINE D2 DOPAMINE D2 Short Dopamine D2 receptor Drd2
Type:
G Protein-Coupled Receptor (GPCR)
Mol. Mass.:
50931.60
Organism:
Rattus norvegicus (rat)
Description:
P61169
Residue:
444
  
Inhibitor
Name:
BDBM50010620
Synonyms:
3-(Octahydro-indolizin-8-yl)-phenol | CHEMBL8074
Type:
Small organic molecule
Emp. Form.:
C14H19NO
Mol. Mass.:
217.3068
SMILES:
Oc1cccc(c1)[C@@H]1CCCN2CCCC12
: