Target
D(2) dopamine receptor
Ligand
BDBM50010614
Substrate
Meas. Tech.
ChEMBL_61576 (CHEMBL675090)
IC50
13000±n/a nM
Citation
 Liljefors, TBøgesø, KPHyttel, JWikström, HSvensson, KCarlsson, A Pre- and postsynaptic dopaminergic activities of indolizidine and quinolizidine derivatives of 3-(3-hydroxyphenyl)-N-(n-propyl)piperidine (3-PPP). Further developments of a dopamine receptor model. J Med Chem 33:1015-22 (1990)  
Target
Name:
D(2) dopamine receptor
Synonyms:
DOPAMINE D2 DOPAMINE D2 Short Dopamine D2 receptor Drd2
Type:
G Protein-Coupled Receptor (GPCR)
Mol. Mass.:
50931.60
Organism:
Rattus norvegicus (rat)
Description:
P61169
Residue:
444
  
Inhibitor
Name:
BDBM50010614
Synonyms:
3-(Octahydro-quinolizin-1-yl)-phenol isomer-13-(Octahydro-quinolizin-1-yl)-phenol | isomer-23-(Octahydro-quinolizin-1-yl)-phenol
Type:
Small organic molecule
Emp. Form.:
C15H21NO
Mol. Mass.:
231.3333
SMILES:
Oc1cccc(c1)C1CCCN2CCCCC12
: