Target
D(2) dopamine receptor
Ligand
BDBM50010696
Substrate
Meas. Tech.
ChEBML_62260
Ki
18±n/a nM
Citation
 Gao, YGBaldessarini, RJKula, NSNeumeyer, JL Synthesis and dopamine receptor affinities of enantiomers of 2-substituted apomorphines and their N-n-propyl analogues. J Med Chem 33:1800-5 (1990)  
Target
Name:
D(2) dopamine receptor
Synonyms:
DOPAMINE D2 DOPAMINE D2 Short Dopamine D2 receptor Drd2
Type:
G Protein-Coupled Receptor (GPCR)
Mol. Mass.:
50931.60
Organism:
Rattus norvegicus (rat)
Description:
P61169
Residue:
444
  
Inhibitor
Name:
BDBM50010696
Synonyms:
(R)-2-Bromo-6-methyl-5,6,6a,7-tetrahydro-4H-dibenzo[de,g]quinoline-10,11-diol CHEMBL276326
Type:
Small organic molecule
Emp. Form.:
C17H16BrNO2
Mol. Mass.:
346.218
SMILES:
CN1CCc2cc(Br)cc-3c2[C@H]1Cc1ccc(O)c(O)c-31
: