Target
Kappa-type opioid receptor
Ligand
BDBM50010700
Substrate
Meas. Tech.
ChEBML_145800
IC50
0.391000±n/a nM
Citation
 Kawasaki, AMKnapp, RJKramer, THWire, WSVasquez, OSYamamura, HIBurks, TFHruby, VJ Design and synthesis of highly potent and selective cyclic dynorphin A analogues. J Med Chem 33:1874-9 (1990)  
Target
Name:
Kappa-type opioid receptor
Synonyms:
Kappa Opioid Receptor OPRK1 Opiate Kappa 1 | mu/kappa opioid receptor
Type:
G Protein-Coupled Receptor (GPCR)
Mol. Mass.:
42744.99
Organism:
Cavia porcellus (domestic guinea pig)
Description:
P41144
Residue:
380
  
Inhibitor
Name:
BDBM50010700
Synonyms:
CHEMBL265824 | H-Tyr-Gly-Gly-Phe-Cys-Arg-Arg-D-Ala-Arg-Pro-Cys-NH2
Type:
Small organic molecule
Emp. Form.:
C54H83N21O12S2
Mol. Mass.:
1282.5
SMILES:
C[C@H]1NC(=O)[C@H](CCCNC(N)=N)NC(=O)[C@H](CCCNC(N)=N)NC(=O)[C@H](CSSC[C@H](NC(=O)[C@@H]2CCCN2C(=O)[C@H](CCCNC(N)=N)NC1=O)C(N)=O)NC(=O)[C@H](Cc1ccccc1)NC(=O)CNC(=O)CNC(=O)[C@@H](N)Cc1ccc(O)cc1
: