Target
Polyunsaturated fatty acid 5-lipoxygenase
Ligand
BDBM50010953
Substrate
Meas. Tech.
ChEMBL_163797 (CHEMBL772970)
IC50
660±n/a nM
Citation
 Ohkawa, STerao, STerashita, ZShibouta, YNishikawa, K Dual inhibitors of thromboxane A2 synthase and 5-lipoxygenase with scavenging activity of active oxygen species. Synthesis of a novel series of (3-pyridylmethyl)benzoquinone derivatives. J Med Chem 34:267-76 (1991)  
Target
Name:
Polyunsaturated fatty acid 5-lipoxygenase
Synonyms:
Alox5 LOX5_RAT
Type:
PROTEIN
Mol. Mass.:
78082.31
Organism:
Rattus norvegicus
Description:
ChEMBL_1432947
Residue:
673
  
Inhibitor
Name:
BDBM50010953
Synonyms:
2,3,5-Trimethyl-6-(1-pyridin-3-yl-propyl)-[1,4]benzoquinone | CHEMBL90996
Type:
Small organic molecule
Emp. Form.:
C17H19NO2
Mol. Mass.:
269.3383
SMILES:
CC=C(c1cccnc1)c1c(C)c(O)c(C)c(C)c1O
: