Target
Thromboxane-A synthase
Ligand
BDBM50010945
Substrate
Meas. Tech.
ChEBML_209772
IC50
950±n/a nM
Citation
 Ohkawa, STerao, STerashita, ZShibouta, YNishikawa, K Dual inhibitors of thromboxane A2 synthase and 5-lipoxygenase with scavenging activity of active oxygen species. Synthesis of a novel series of (3-pyridylmethyl)benzoquinone derivatives. J Med Chem 34:267-76 (1991)  
Target
Name:
Thromboxane-A synthase
Synonyms:
CYP5 Cytochrome P450 5A1 TBXAS1 TXA synthase TXS Thromboxane A2 Synthase (P450 TxA2) Thromboxane prostanoid Thromboxane-A synthase
Type:
Enzyme
Mol. Mass.:
60524.67
Organism:
Homo sapiens (Human)
Description:
P24557
Residue:
533
  
Inhibitor
Name:
BDBM50010945
Synonyms:
Acetic acid 6-pyridin-3-yl-6-(2,4,5-trimethyl-3,6-dioxo-cyclohexa-1,4-dienyl)-hexyl ester | CHEMBL92247
Type:
Small organic molecule
Emp. Form.:
C22H27NO4
Mol. Mass.:
369.4541
SMILES:
CC(=O)OCCCCC=C(c1cccnc1)c1c(C)c(O)c(C)c(C)c1O
: