Target
Polyunsaturated fatty acid 5-lipoxygenase
Ligand
BDBM50010944
Substrate
Meas. Tech.
ChEBML_163797
IC50
920±n/a nM
Citation
 Ohkawa, STerao, STerashita, ZShibouta, YNishikawa, K Dual inhibitors of thromboxane A2 synthase and 5-lipoxygenase with scavenging activity of active oxygen species. Synthesis of a novel series of (3-pyridylmethyl)benzoquinone derivatives. J Med Chem 34:267-76 (1991)  
Target
Name:
Polyunsaturated fatty acid 5-lipoxygenase
Synonyms:
Alox5 LOX5_RAT
Type:
PROTEIN
Mol. Mass.:
78082.31
Organism:
Rattus norvegicus
Description:
ChEMBL_1432947
Residue:
673
  
Inhibitor
Name:
BDBM50010944
Synonyms:
2-(5-Hydroxy-1-pyridin-3-yl-pentyl)-3,5,6-trimethyl-[1,4]benzoquinone | CHEMBL93265
Type:
Small organic molecule
Emp. Form.:
C19H23NO3
Mol. Mass.:
313.3908
SMILES:
Cc1c(C)c(O)c(C(=CCCCO)c2cccnc2)c(C)c1O
: