Target
Thromboxane-A synthase
Ligand
BDBM50010960
Substrate
Meas. Tech.
ChEBML_209772
IC50
26±n/a nM
Citation
 Ohkawa, STerao, STerashita, ZShibouta, YNishikawa, K Dual inhibitors of thromboxane A2 synthase and 5-lipoxygenase with scavenging activity of active oxygen species. Synthesis of a novel series of (3-pyridylmethyl)benzoquinone derivatives. J Med Chem 34:267-76 (1991)  
Target
Name:
Thromboxane-A synthase
Synonyms:
CYP5 Cytochrome P450 5A1 TBXAS1 TXA synthase TXS Thromboxane A2 Synthase (P450 TxA2) Thromboxane prostanoid Thromboxane-A synthase
Type:
Enzyme
Mol. Mass.:
60524.67
Organism:
Homo sapiens (Human)
Description:
P24557
Residue:
533
  
Inhibitor
Name:
BDBM50010960
Synonyms:
(E)-7-Phenyl-7-pyridin-3-yl-hept-6-enoic acid 7-Phenyl-7-pyridin-3-yl-hept-6-enoic acid(CV-4151) CV-4151
Type:
Small organic molecule
Emp. Form.:
C18H19NO2
Mol. Mass.:
281.349
SMILES:
OC(=O)CCCC\C=C(/c1ccccc1)c1cccnc1
: