Target
Polyunsaturated fatty acid 5-lipoxygenase
Ligand
BDBM50010965
Substrate
Meas. Tech.
ChEMBL_163797 (CHEMBL772970)
IC50
8700.0±n/a nM
Citation
 Ohkawa, STerao, STerashita, ZShibouta, YNishikawa, K Dual inhibitors of thromboxane A2 synthase and 5-lipoxygenase with scavenging activity of active oxygen species. Synthesis of a novel series of (3-pyridylmethyl)benzoquinone derivatives. J Med Chem 34:267-76 (1991)  
Target
Name:
Polyunsaturated fatty acid 5-lipoxygenase
Synonyms:
Alox5 LOX5_RAT
Type:
PROTEIN
Mol. Mass.:
78082.31
Organism:
Rattus norvegicus
Description:
ChEMBL_1432947
Residue:
673
  
Inhibitor
Name:
BDBM50010965
Synonyms:
3-(2,5-Dimethyl-3,6-dioxo-4-pyridin-3-ylmethyl-cyclohexa-1,4-dienyl)-2-methyl-acrylic acid | CHEMBL329636
Type:
Small organic molecule
Emp. Form.:
C18H17NO4
Mol. Mass.:
311.3319
SMILES:
CC(=Cc1c(O)c(=C)c(Cc2cccnc2)c(O)c1=C)C(O)=O
: