Target
Polyunsaturated fatty acid 5-lipoxygenase
Ligand
BDBM50010964
Substrate
Meas. Tech.
ChEMBL_163797 (CHEMBL772970)
IC50
5200±n/a nM
Citation
 Ohkawa, STerao, STerashita, ZShibouta, YNishikawa, K Dual inhibitors of thromboxane A2 synthase and 5-lipoxygenase with scavenging activity of active oxygen species. Synthesis of a novel series of (3-pyridylmethyl)benzoquinone derivatives. J Med Chem 34:267-76 (1991)  
Target
Name:
Polyunsaturated fatty acid 5-lipoxygenase
Synonyms:
Alox5 LOX5_RAT
Type:
PROTEIN
Mol. Mass.:
78082.31
Organism:
Rattus norvegicus
Description:
ChEMBL_1432947
Residue:
673
  
Inhibitor
Name:
BDBM50010964
Synonyms:
2,3-Dimethoxy-5-methyl-6-pyridin-3-ylmethyl-[1,4]benzoquinone | CHEMBL93777
Type:
Small organic molecule
Emp. Form.:
C15H15NO4
Mol. Mass.:
273.2839
SMILES:
COC1=C(OC)C(=O)C(Cc2cccnc2)=C(C)C1=O
: