Target
Thromboxane-A synthase
Ligand
BDBM50010970
Substrate
Meas. Tech.
ChEBML_209772
IC50
63±n/a nM
Citation
 Ohkawa, STerao, STerashita, ZShibouta, YNishikawa, K Dual inhibitors of thromboxane A2 synthase and 5-lipoxygenase with scavenging activity of active oxygen species. Synthesis of a novel series of (3-pyridylmethyl)benzoquinone derivatives. J Med Chem 34:267-76 (1991)  
Target
Name:
Thromboxane-A synthase
Synonyms:
CYP5 Cytochrome P450 5A1 TBXAS1 TXA synthase TXS Thromboxane A2 Synthase (P450 TxA2) Thromboxane prostanoid Thromboxane-A synthase
Type:
Enzyme
Mol. Mass.:
60524.67
Organism:
Homo sapiens (Human)
Description:
P24557
Residue:
533
  
Inhibitor
Name:
BDBM50010970
Synonyms:
7-Pyridin-3-yl-7-(2,4,5-trimethyl-3,6-dioxo-cyclohexa-1,4-dienyl)-heptanoic acid | CHEMBL420251
Type:
Small organic molecule
Emp. Form.:
C21H25NO4
Mol. Mass.:
355.4275
SMILES:
Cc1c(C)c(O)c(C(=CCCCCC(O)=O)c2cccnc2)c(C)c1O
: