Target
3-hydroxy-3-methylglutaryl-coenzyme A reductase
Ligand
BDBM50011023
Substrate
Meas. Tech.
ChEBML_80648
IC50
180±n/a nM
Citation
 Roth, BDBlankley, CJChucholowski, AWFerguson, EHoefle, MLOrtwine, DFNewton, RSSekerke, CSSliskovic, DRStratton, CD Inhibitors of cholesterol biosynthesis. 3. Tetrahydro-4-hydroxy-6-[2-(1H-pyrrol-1-yl)ethyl]-2H-pyran-2-one inhibitors of HMG-CoA reductase. 2. Effects of introducing substituents at positions three and four of the pyrrole nucleus. J Med Chem 34:357-66 (1991)  
Target
Name:
3-hydroxy-3-methylglutaryl-coenzyme A reductase
Synonyms:
HMDH_RAT Hmgcr
Type:
Enzyme
Mol. Mass.:
96689.85
Organism:
Rattus norvegicus (rat)
Description:
Isolated rat liver microsomes were used as enzyme source.
Residue:
887
  
Inhibitor
Name:
BDBM50011023
Synonyms:
2-(4-Fluoro-phenyl)-1-[2-(4-hydroxy-6-oxo-tetrahydro-pyran-2-yl)-ethyl]-5-isopropyl-1H-pyrrole-3,4-dicarboxylic acid dimethyl ester | CHEMBL123357
Type:
Small organic molecule
Emp. Form.:
C24H28FNO7
Mol. Mass.:
461.48
SMILES:
COC(=O)c1c(C(C)C)n(CC[C@@H]2C[C@@H](O)CC(=O)O2)c(c1C(=O)OC)-c1ccc(F)cc1
: