Target
3-hydroxy-3-methylglutaryl-coenzyme A reductase
Ligand
BDBM50011045
Substrate
Meas. Tech.
ChEBML_80647
IC50
720±n/a nM
Citation
 Sliskovic, DRPicard, JARoark, WHRoth, BDFerguson, EKrause, BRNewton, RSSekerke, CShaw, MK Inhibitors of cholesterol biosynthesis. 4. trans-6-[2-(substituted-quinolinyl)ethenyl/ethyl]tetrahydro-4-hydroxy-2 H-pyran-2-ones, a novel series of HMG-CoA reductase inhibitors. J Med Chem 34:367-73 (1991)  
Target
Name:
3-hydroxy-3-methylglutaryl-coenzyme A reductase
Synonyms:
HMDH_RAT Hmgcr
Type:
Enzyme
Mol. Mass.:
96689.85
Organism:
Rattus norvegicus (rat)
Description:
Isolated rat liver microsomes were used as enzyme source.
Residue:
887
  
Inhibitor
Name:
BDBM50011045
Synonyms:
6-{2-[6-Chloro-4-(4-fluoro-phenyl)-2-methyl-quinolin-3-yl]-vinyl}-4-hydroxy-tetrahydro-pyran-2-one | CHEMBL334113
Type:
Small organic molecule
Emp. Form.:
C23H19ClFNO3
Mol. Mass.:
411.853
SMILES:
Cc1nc2ccc(Cl)cc2c(-c2ccc(F)cc2)c1\C=C\[C@@H]1C[C@@H](O)CC(=O)O1
: