Target
Platelet-activating factor receptor
Ligand
BDBM50011079
Substrate
Meas. Tech.
ChEBML_177423
IC50
110±n/a nM
Citation
 Bartrolí, JCarceller, EMerlos, MGarcía-Rafanell, JForn, J Disubstituted tetrahydrofurans and dioxolanes and PAF antagonists. J Med Chem 34:373-86 (1991)  
Target
Name:
Platelet-activating factor receptor
Synonyms:
PAF-R PTAFR_CAVPO Platelet-activating factor receptor
Type:
Protein
Mol. Mass.:
39005.63
Organism:
Cavia porcellus
Description:
Residue:
342
  
Inhibitor
Name:
BDBM50011079
Synonyms:
2-{[Acetyl-(4-tetradecyloxymethyl-[1,3]dioxolan-2-ylmethoxycarbonyl)-amino]-methyl}-1-ethyl-pyridinium; iodide | CHEMBL125465
Type:
Small organic molecule
Emp. Form.:
C30H51N2O6
Mol. Mass.:
535.7352
SMILES:
CCCCCCCCCCCCCCOCC1COC(COC(=O)N(Cc2cccc[n+]2CC)C(C)=O)O1
: