Target
Platelet-activating factor receptor
Ligand
BDBM50011119
Substrate
Meas. Tech.
ChEBML_177423
IC50
1900±n/a nM
Citation
 Bartrolí, JCarceller, EMerlos, MGarcía-Rafanell, JForn, J Disubstituted tetrahydrofurans and dioxolanes and PAF antagonists. J Med Chem 34:373-86 (1991)  
Target
Name:
Platelet-activating factor receptor
Synonyms:
PAF-R PTAFR_CAVPO Platelet-activating factor receptor
Type:
Protein
Mol. Mass.:
39005.63
Organism:
Cavia porcellus
Description:
Residue:
342
  
Inhibitor
Name:
BDBM50011119
Synonyms:
CHEMBL341265 | Toluene-4-sulfonate1-[6-(4-tetradecyl-tetrahydro-furan-2-ylmethoxy)-hexyl]-quinolinium;Toluene-4-sulfonate
Type:
Small organic molecule
Emp. Form.:
C34H56NO2
Mol. Mass.:
510.8134
SMILES:
CCCCCCCCCCCCCCC1COC(COCCCCCC[n+]2cccc3ccccc23)C1
: