Target
Platelet-activating factor receptor
Ligand
BDBM50011046
Substrate
Meas. Tech.
ChEBML_177423
IC50
6000±n/a nM
Citation
 Bartrolí, JCarceller, EMerlos, MGarcía-Rafanell, JForn, J Disubstituted tetrahydrofurans and dioxolanes and PAF antagonists. J Med Chem 34:373-86 (1991)  
Target
Name:
Platelet-activating factor receptor
Synonyms:
PAF-R PTAFR_CAVPO Platelet-activating factor receptor
Type:
Protein
Mol. Mass.:
39005.63
Organism:
Cavia porcellus
Description:
Residue:
342
  
Inhibitor
Name:
BDBM50011046
Synonyms:
CHEMBL127799 | Toluene-4-sulfonate1-methyl-1-[6-(4-tetradecyl-tetrahydro-furan-2-ylmethoxy)-hexyl]-1H-imidazol-1-ium;Toluene-4-sulfonate
Type:
Small organic molecule
Emp. Form.:
C29H55N2O2
Mol. Mass.:
463.7587
SMILES:
CCCCCCCCCCCCCCC1COC(COCCCCCC[N+]2(C)C=CN=C2)C1
: