Target
Platelet-activating factor receptor
Ligand
BDBM50011126
Substrate
Meas. Tech.
ChEBML_177423
IC50
8200±n/a nM
Citation
 Bartrolí, JCarceller, EMerlos, MGarcía-Rafanell, JForn, J Disubstituted tetrahydrofurans and dioxolanes and PAF antagonists. J Med Chem 34:373-86 (1991)  
Target
Name:
Platelet-activating factor receptor
Synonyms:
PAF-R PTAFR_CAVPO Platelet-activating factor receptor
Type:
Protein
Mol. Mass.:
39005.63
Organism:
Cavia porcellus
Description:
Residue:
342
  
Inhibitor
Name:
BDBM50011126
Synonyms:
CHEMBL125680 | Toluene-4-sulfonatetrimethyl-[6-(4-tetradecyl-tetrahydro-furan-2-ylmethoxy)-hexyl]-ammonium;Toluene-4-sulfonate
Type:
Small organic molecule
Emp. Form.:
C28H58NO2
Mol. Mass.:
440.7651
SMILES:
CCCCCCCCCCCCCCC1COC(COCCCCCC[N+](C)(C)C)C1
: