Target
Platelet-activating factor receptor
Ligand
BDBM50011074
Substrate
Meas. Tech.
ChEBML_177423
IC50
2700±n/a nM
Citation
 Bartrolí, JCarceller, EMerlos, MGarcía-Rafanell, JForn, J Disubstituted tetrahydrofurans and dioxolanes and PAF antagonists. J Med Chem 34:373-86 (1991)  
Target
Name:
Platelet-activating factor receptor
Synonyms:
PAF-R PTAFR_CAVPO Platelet-activating factor receptor
Type:
Protein
Mol. Mass.:
39005.63
Organism:
Cavia porcellus
Description:
Residue:
342
  
Inhibitor
Name:
BDBM50011074
Synonyms:
CHEMBL124980 | Toluene-4-sulfonate1-[6-(2-heptadecyl-[1,3]dioxolan-4-ylmethoxy)-hexyl]-quinolinium;Toluene-4-sulfonate
Type:
Small organic molecule
Emp. Form.:
C36H60NO3
Mol. Mass.:
554.866
SMILES:
CCCCCCCCCCCCCCCCCC1OCC(COCCCCCC[n+]2cccc3ccccc23)O1
: